{"text_format":"1","workbook":"xlsx","n_sheets":6,"sheets":["ACCUEIL","LINEAIRE","DEGRESSIF","BD","LINEAIRE (2)","DEGRESSIF (2)"],"not_rendered":{"charts":0,"images":2,"macros":1,"external_links":0,"defined_names":4,"comments":1,"pivot_tables":0},"unopened":[],"bounds":{"document_bytes":16777216,"sheet_cells":100000,"rows_first":2000,"rows_last":500,"rows_between":2000,"halvings":0,"cell_chars":16384,"cell_head_chars":4096},"cells_cut":0,"cells_raw":0,"read":"whole","date_system":"1900"}

{"sheet":"ACCUEIL","index":0,"n_rows":9,"n_cols":20,"rows_kept":9,"cut":false,"hidden":false,"merged":[[1,3,2,10]]}
[null,null,null,null,null,null,null,null,null,null,null,null,null,null,null,null,null,0.04,"25 ans"]
[null,null,null,"CALCULS DES AMORTISSEMENTS",null,null,null,null,null,null,null,null,null,null,null,null,null,0.06,"16 ans +7 mois",7]
[null,null,null,null,null,null,null,null,null,null,null,null,null,null,null,null,null,0.08,"12 ans+6 mois",6]
[null,null,null,null,null,null,null,null,null,null,null,null,null,null,null,null,null,0.1,"10 ans"]
[null,null,null,null,null,null,null,null,null,null,null,null,null,null,null,null,null,0.2,"5 ans"]
[null,null,null,null,null,null,null,null,null,null,null,null,null,null,null,null,null,0.3,"3 ans+4 mois",4]
[null,null,null,null,null,null,null,null,null,null,null,null,null,null,null,null,null,0.4,"2 ans+6 mois",6]
[null,null,null,null,null,null,null,null,null,null,null,null,null,null,null,null,null,0.55000000000000004,"1 an+9 mois",9]
[null,null,null,null,null,null,null,null,null,null,null,null,null,null,null,null,null,1,"1 an"]

{"sheet":"LINEAIRE","index":1,"n_rows":24,"n_cols":6,"rows_kept":24,"cut":false,"hidden":false,"merged":[[8,3,8,4],[6,1,7,1],[6,2,7,2],[4,2,4,5],[3,1,3,5],[5,3,5,4],[6,3,6,4],[7,3,7,4]]}
[" "]
[null,8]
[]
[null,"CALCULS AMORTISSEMENTS LINÉAIRE"]
[null,"APPAREIL AMORTI →","Droit au Bail"]
[null,"DATE DE MISE                  EN SERVICE →","2024-03-12","DATE FIN EXERCICE →",null,"2024-12-31"]
[null,"MONTANT →",10000,"TAUX D'AMORTISSEMENT",null,7.6923076923076927E-2]
[null,null,null,"NB D'ANNÉES AMORTISSEMENT",null,13]
[null,{"$f":"IF(C7=0,\"\",IF(F8=0,\"\",IF(C6=0,\"\",IF(F6=0,\"\",\"NB de jour utilisation année  \"&  YEAR(C6)))))","v":"NB de jour utilisation année  2024"},{"$f":"(F6-C6)/365*360","v":289.97260273972603},"Valeur mensuelle",null,{"$f":"IF($F$7=4%,$C$7/12/25,IF($F$7=6%,$C$7/12/16.666,IF($F$7=8%,$C$7/12/12.5,IF($F$7=10%,$C$7/12/10,IF($F$7=20%,$C$7/12/5,IF($F$7=30%,$C$7/12/3.333,IF($F$7=40%,$C$7/12/2.5,IF(F7=55%,$C$7/12/1.818,IF($F$7=100%,$C$7/12,C7/(F8*12))))))))))","v":64.102564102564102}]
[null,"ANNÉES AMORTISSEMENTS","NB JOURS",{"$f":"\"AMORT  - \"&(F8)","v":"AMORT  - 13"},"Valeurs résiduelles","valeurs             amorties"]
[null,{"$f":"\"    AN 1       \" & YEAR($F$6)","v":"    AN 1       2024"},{"$f":"C9","v":289.97260273972603},{"$f":"F9/30*C11","v":619.59957850368812},{"$f":"C7-D11","v":9380.4004214963115},{"$f":"D11","v":619.59957850368812}]
[null,{"$f":"\"    AN \" & ROW()-10 & \"       \"  &   RIGHT(B11,4)+1","v":"    AN 2       2025"},360,{"$f":"$F$9/30*C12","v":769.23076923076917},{"$f":"C7-F12","v":8611.169652265542},{"$f":"F11+D12","v":1388.8303477344573}]
[null,{"$f":"\"    AN \" & ROW()-10 & \"       \"  &   RIGHT(B12,4)+1","v":"    AN 3       2026"},360,{"$f":"$F$9/30*C13","v":769.23076923076917},{"$f":"INDIRECT(\"E\" & ROW()-1)-D13","v":7841.9388830347725},2158.0611169652266]
[null,"    AN 4       2027",360,{"$f":"$F$9/30*C14","v":769.23076923076917},{"$f":"INDIRECT(\"E\" & ROW()-1)-D14","v":7072.708113804003},2927.2918861959956]
[null,"    AN 5       2028",360,769.23076923076917,6303.4773445732335,3696.5226554267647]
[null,"    AN 6       2029",360,769.23076923076917,5534.246575342464,4465.7534246575342]
[null,"    AN 7       2030",360,769.23076923076917,4765.0158061116945,5234.9841938883037]
[null,"    AN 8       2031",360,769.23076923076917,3995.7850368809254,6004.2149631190732]
[null,"    AN 9       2032",360,769.23076923076917,3226.5542676501564,6773.4457323498427]
[null,"    AN 10       2033",360,769.23076923076917,2457.3234984193873,7542.6765015806122]
[null,"    AN 11       2034",360,769.23076923076917,1688.0927291886183,8311.9072708113817]
[null,"    AN 12       2035",360,769.23076923076917,918.86195995784908,9081.1380400421513]
[null,"    AN 13       2036",360,769.23076923076917,149.63119072707991,9850.3688092729208]
[null,{"$f":"\"COMPLÉMENT AN\"&(RIGHT($B$11,4))","v":"COMPLÉMENT AN2024"},70.027397260273972,{"$f":"INDIRECT(\"E\"&ROW()-1)","v":149.63119072707991},0,{"$f":"F23+D24","v":10000}]

{"sheet":"DEGRESSIF","index":2,"n_rows":37,"n_cols":8,"rows_kept":37,"cut":false,"hidden":false,"merged":[[6,3,6,4],[4,2,4,5],[3,1,3,5],[5,3,5,4],[7,5,8,5]]}
[" "]
[null,3]
[]
[null,"CALCULS AMORTISSEMENTS DÉGRESSIF"]
[null,"APPAREIL AMORTI →","Voiture"]
[null,"DATE DE MISE EN SERVICE →","2024-03-01","DATE FIN EXERCICE →",null,"2024-12-31"]
[null,"MONTANT →",10000,"NB D'ANNÉES AMORTISSEMENT",null,4]
[null,"TEMPS AMMORT","De 2 à 4 ans","de 5 à 6 ans","7 ans et +",{"$f":"IF($C$6=\"\",\"\",IF($F$6=\"\",\"\",IF(C7=\"\",\"\",IF(F7=\"\",\"\",\"NB de mois utilisation année  \"&YEAR(C6)))))","v":"NB de mois utilisation année  2024"}]
[null,"COEF amortissement ",1.25,1.75,2.25]
[null,"TA =TAUX D'AMORTISSEMENT ",{"$f":"IF(AND($F$7>2,$F$7<5),(1/$F$7)*$C9,\"\")","v":0.3125},{"$f":"IF(AND($F$7>4,$F$7<7),(1/$F$7)*$D9,\"\")","v":""},{"$f":"IF($F$7>6,(1/$F$7)*$E9,\"\")","v":""},{"$f":"DATEDIF(C6,F6,\"m\")","v":9}]
[null,"ANNÉES","NB MOIS ",{"$f":"IF(F7=\"\",\"\",IF(F7>0,\"AMORT  \"&(F7) &\"   ANS\"))","v":"AMORT  4   ANS"},"Valeurs résiduelles","Valeur amortie",{"$f":"C7/F7","v":2500}]
[null,{"$f":"\"    AN \" &ROW()-11 & \"       \" & YEAR($F$6)","v":"    AN 1       2024"},{"$f":"F10","v":9},{"$f":"G12","v":2343.75},{"$f":"$C$7-D12","v":7656.25},{"$f":"D12","v":2343.75},{"$f":"IF(AND($F$7>2,$F$7<5),($C$7/12*F10)*$C$10,                                          IF(AND($F$7>4,$F$7<7),($C$7/12*F10)*$D$10,                IF($F$7>6,($C$7/12*F10)*$E$10,\"\")))","v":2343.75},{"$f":"$F$7-(ROW()-12)","v":4}]
[null,{"$f":"\"    AN \" &ROW()-11 & \"       \" & RIGHT(B12,4)+1","v":"    AN 2       2025"},12,{"$f":"IF(G13<$G$11,E12/H13,G13)","v":2552.0833333333335},{"$f":"E12-D13","v":5104.1666666666661},{"$f":"F12+D13","v":4895.8333333333339},{"$f":" IF(AND($F$7>2,$F$7<5),(E12*$C$10),    IF(AND($F$7>4,$F$7<7), (E12*$D$10),IF($F$7>6,(E12*$E$10),\"\")))","v":2392.578125},{"$f":"$F$7-(ROW()-12)","v":3}]
[null,{"$f":"\"    AN \" &ROW()-11 & \"       \" & RIGHT(B13,4)+1","v":"    AN 3       2026"},12,2552.083333333333,{"$f":"E13-D14","v":2552.083333333333},{"$f":"F13+D14","v":7447.916666666667},{"$f":" IF(AND($F$7>2,$F$7<5),(E13*$C$10),    IF(AND($F$7>4,$F$7<7), (E13*$D$10),IF($F$7>6,(E13*$E$10),\"\")))","v":1595.052083333333},2]
[null,{"$f":"\"    AN \" &ROW()-11 & \"       \" & RIGHT(B14,4)+1","v":"    AN 4       2027"},12,2552.083333333333,{"$f":"E14-D15","v":0},{"$f":"F14+D15","v":10000},{"$f":" IF(AND($F$7>2,$F$7<5),(E14*$C$10),    IF(AND($F$7>4,$F$7<7), (E14*$D$10),IF($F$7>6,(E14*$E$10),\"\")))","v":797.52604166666652},1]
[null,null,null,null,null,null,0,0]
[null,null,null,null,null,null,0,-1]
[null,null,null,null,null,null,0,-2]
[null,null,null,null,null,null,0,-3]
[null,null,null,null,null,null,0,-4]
[null,null,null,null,null,null,0,-5]
[null,null,null,null,null,null,0,-6]
[null,null,null,null,null,null,0,-7]
[null,null,null,null,null,null,0,-8]
[null,null,null,null,null,null,0,-9]
[null,null,null,null,null,null,0,-10]
[null,null,null,null,null,null,0,-11]
[null,null,null,null,null,null,0,-12]
[null,null,null,null,null,null,0,-13]
[null,null,null,null,null,null,0,-14]
[null,null,null,null,null,null,0,-15]
[null,null,null,null,null,null,0,-16]
[null,null,null,null,null,null,0,-17]
[null,null,null,null,null,null,0,-18]
[null,null,null,null,null,null,0,-19]
[null,null,null,null,null,null,0,-20]
[null,null,null,null,null,null,0,-21]

{"sheet":"BD","index":3,"n_rows":8,"n_cols":8,"rows_kept":8,"cut":false,"hidden":false,"merged":[]}
["Matériel","Date ","Montant","Fin exercice","% ou an","Lin=vrai_Dégres=Faux","Mois en +","Droit Bail"]
["Tondeuse","2024-02-01",5000,"2024-12-31",0.3,"VRAI",4]
["Voiture","2024-03-01",10000,"2024-12-31",25,"FAUX"]
["Fourgon","2024-03-08",8000,"2024-12-31",0.08,"VRAI",6]
["Tronconneuse","2024-03-09",6000,"2024-12-31",10,"FAUX"]
["le 9_3","2024-03-09",8000,"2024-09-30",0.06,"VRAI",7]
["essai du 10.03","2024-03-10",1000,"2024-09-30",4,"FAUX"]
["Droit au Bail","2024-03-12",10000,"2024-12-31",13,"VRAI",null,1]

{"sheet":"LINEAIRE (2)","index":4,"n_rows":36,"n_cols":6,"rows_kept":36,"cut":false,"hidden":true,"merged":[[8,3,8,4],[3,1,3,4],[4,2,4,5],[5,3,5,4],[6,1,7,1],[6,2,7,2],[6,3,6,4],[7,3,7,4]]}
[" "]
[]
[]
[null,"CALCULS AMORTISSEMENTS LINÉAIRE"]
[null,"APPAREIL AMORTI →","Tondeuse"]
[null,"DATE DE MISE                  EN SERVICE →","2024-02-01","DATE FIN EXERCICE →",null,"2024-12-31"]
[null,"MONTANT →",5000,"TAUX D'AMORTISSEMENT",null,0.04]
[null,null,null,"NB D'ANNÉES AMORTISSEMENT",null,{"$f":"IF(F7=4%,\"25 ans\",IF(F7=6%,\"16 ans 7 mois\",IF(F7=8%,\"12.ans 6 mois\",IF(F7=10%,\"10 ans\",IF(F7=20%,\"5 ans\",IF(F7=30%,\"3 ans 4 mois\",IF(F7=40%,\"2 ans 6 mois\",IF(F7=55%,\"1 an 9 mois\",IF(F7=100%,\"1 an\",IF(F7=\"Durée de bail\",\"Durée du bail\",\"\"))))))))))","v":"25 ans"}]
[null,{"$f":"IF(C7=0,\"\",IF(F8=0,\"\",IF(C6=0,\"\",IF(F6=0,\"\",\"NB de jour utilisation année  \"&  YEAR(C6)))))","v":"NB de jour utilisation année  2024"},{"$f":"(F6-C6)/365*360","v":329.42465753424659},"Valeur mensuelle",null,{"$f":"IF($F$7=4%,$C$7/12/25,IF($F$7=6%,$C$7/12/16.666,IF($F$7=8%,$C$7/12/12.5,IF($F$7=10%,$C$7/12/10,IF($F$7=20%,$C$7/12/5,IF($F$7=30%,$C$7/12/3.333,IF($F$7=40%,$C$7/12/2.5,IF(F7=55%,$C$7/12/1.818,IF($F$7=100%,$C$7/12,C7/(F8*12))))))))))","v":16.666666666666668}]
[null,"ANNÉES AMORTISSEMENTS","NB JOURS",{"$f":"\"AMORT  -             \"&(F8)","v":"AMORT  -             25 ans"},"Valeurs résiduelles","valeurs             amorties"]
[null,{"$f":"\"    AN 1       \" & YEAR($F$6)","v":"    AN 1       2024"},{"$f":"C9","v":329.42465753424659},{"$f":"F9/30*C11","v":183.01369863013701},{"$f":"C7-D11","v":4816.9863013698632},{"$f":"D11","v":183.01369863013701}]
[null,{"$f":"\"    AN \" & ROW()-10 & \"       \"  &   RIGHT(B11,4)+1","v":"    AN 2       2025"},360,{"$f":"$F$9/30*C12","v":200},{"$f":"C7-F12","v":4616.9863013698632},{"$f":"F11+D12","v":383.01369863013701}]
[null,{"$f":"\"    AN \" & ROW()-10 & \"       \"  &   RIGHT(B12,4)+1","v":"    AN 3       2026"},360,{"$f":"$F$9/30*C13","v":200},{"$f":"INDIRECT(\"E\" & ROW()-1)-D13","v":4416.9863013698632},583.01369863013701]
[null,"    AN 4       2027",360,{"$f":"$F$9/30*C14","v":200},{"$f":"INDIRECT(\"E\" & ROW()-1)-D14","v":4216.9863013698632},783.01369863013701]
[null,"    AN 5       2028",360,200,4016.9863013698632,983.01369863013701]
[null,"    AN 6       2029",360,200,3816.9863013698632,1183.013698630137]
[null,"    AN 7       2030",360,200,3616.9863013698632,1383.013698630137]
[null,"    AN 8       2031",360,200,3416.9863013698632,1583.013698630137]
[null,"    AN 9       2032",360,200,3216.9863013698632,1783.013698630137]
[null,"    AN 10       2033",360,200,3016.9863013698632,1983.013698630137]
[null,"    AN 11       2034",360,200,2816.9863013698632,2183.0136986301368]
[null,"    AN 12       2035",360,200,2616.9863013698632,2383.0136986301368]
[null,"    AN 13       2036",360,200,2416.9863013698632,2583.0136986301368]
[null,"    AN 14       2037",360,200,2216.9863013698632,2783.0136986301368]
[null,"    AN 15       2038",360,200,2016.9863013698632,2983.0136986301368]
[null,"    AN 16       2039",360,200,1816.9863013698632,3183.0136986301368]
[null,"    AN 17       2040",360,200,1616.9863013698632,3383.0136986301368]
[null,"    AN 18       2041",360,200,1416.9863013698632,3583.0136986301368]
[null,"    AN 19       2042",360,200,1216.9863013698632,3783.0136986301368]
[null,"    AN 20       2043",360,200,1016.9863013698632,3983.0136986301368]
[null,"    AN 21       2044",360,200,816.98630136986321,4183.0136986301368]
[null,"    AN 22       2045",360,200,616.98630136986321,4383.0136986301368]
[null,"    AN 23       2046",360,200,416.98630136986321,4583.0136986301368]
[null,"    AN 24       2047",360,200,216.98630136986321,4783.0136986301368]
[null,"    AN 25       2048",360,200,16.986301369863213,4983.0136986301368]
[null,{"$f":"\"COMPLÉMENT AN\"&(RIGHT($B$11,4))","v":"COMPLÉMENT AN2024"},{"$f":"360-$C$11","v":30.575342465753408},{"$f":"INDIRECT(\"E\"&ROW()-1)","v":16.986301369863213},0,{"$f":"F35+D36","v":5000}]

{"sheet":"DEGRESSIF (2)","index":5,"n_rows":36,"n_cols":8,"rows_kept":36,"cut":false,"hidden":true,"merged":[[3,1,3,5],[4,2,4,5],[5,3,5,4],[6,3,6,4],[7,5,8,5]]}
[" "]
[]
[]
[null,"CALCULS AMORTISSEMENTS DÉGRESSIF"]
[null,"APPAREIL AMORTI →","Voiture"]
[null,"DATE DE MISE EN SERVICE →","2024-05-30","DATE FIN EXERCICE →",null,"2024-12-31"]
[null,"MONTANT →",10000,"NB D'ANNÉES AMORTISSEMENT",null,25]
[null,"TEMPS AMMORT","De 2 à 4 ans","de 5 à 6 ans","7 ans et +",{"$f":"\"NB de mois utilisation année  \"&YEAR(C6)","v":"NB de mois utilisation année  2024"}]
[null,"COEF amortissement ",1.25,1.75,2.25]
[null,"TA =TAUX D'AMORTISSEMENT ",{"$f":"IF(AND($F$7>2,$F$7<5),(1/$F$7)*$C9,\"\")","v":""},{"$f":"IF(AND($F$7>4,$F$7<7),(1/$F$7)*$D9,\"\")","v":""},{"$f":"IF($F$7>6,(1/$F$7)*$E9,\"\")","v":0.09},{"$f":"DATEDIF(C6,F6,\"m\")","v":7}]
[null,"ANNÉES","NB MOIS ",{"$f":"IF(F7=\"\",\"\",IF(F7>0,\"AMORT  \"&(F7) &\"   ANS\"))","v":"AMORT  25   ANS"},"Valeurs résiduelles","Valeur amortie",{"$f":"C7/F7","v":400}]
[null,{"$f":"\"    AN \" &ROW()-11 & \"       \" & YEAR($F$6)","v":"    AN 1       2024"},{"$f":"F10","v":7},{"$f":"G12","v":525},{"$f":"$C$7-D12","v":9475},{"$f":"D12","v":525},{"$f":"IF(AND($F$7>2,$F$7<5),($C$7/12*F10)*$C$10,                                          IF(AND($F$7>4,$F$7<7),($C$7/12*F10)*$D$10,                IF($F$7>6,($C$7/12*F10)*$E$10,\"\")))","v":525},{"$f":"F$7-(ROW()-12)","v":25}]
[null,{"$f":"\"    AN \" &ROW()-11 & \"       \" & RIGHT(B12,4)+1","v":"    AN 2       2025"},12,{"$f":"IF(G13<$G$11,E12/H13,G13)","v":852.75},{"$f":"E12-D13","v":8622.25},{"$f":"F12+D13","v":1377.75},{"$f":" IF(AND($F$7>2,$F$7<5),(E12*$C$10),    IF(AND($F$7>4,$F$7<7), (E12*$D$10),IF($F$7>6,(E12*$E$10),\"\")))","v":852.75},{"$f":"F$7-(ROW()-12)","v":24}]
[null,{"$f":"\"    AN \" &ROW()-11 & \"       \" & RIGHT(B13,4)+1","v":"    AN 3       2026"},12,776.00249999999994,{"$f":"E13-D14","v":7846.2475000000004},{"$f":"F13+D14","v":2153.7525000000001},{"$f":" IF(AND($F$7>2,$F$7<5),(E13*$C$10),    IF(AND($F$7>4,$F$7<7), (E13*$D$10),IF($F$7>6,(E13*$E$10),\"\")))","v":776.00249999999994},23]
[null,{"$f":"\"    AN \" &ROW()-11 & \"       \" & RIGHT(B14,4)+1","v":"    AN 4       2027"},12,706.16227500000002,{"$f":"E14-D15","v":7140.0852250000007},{"$f":"F14+D15","v":2859.9147750000002},{"$f":" IF(AND($F$7>2,$F$7<5),(E14*$C$10),    IF(AND($F$7>4,$F$7<7), (E14*$D$10),IF($F$7>6,(E14*$E$10),\"\")))","v":706.16227500000002},22]
[null,{"$f":"\"    AN \" &ROW()-11 & \"       \" & RIGHT(B15,4)+1","v":"    AN 5       2028"},12,642.60767025000007,{"$f":"E15-D16","v":6497.4775547500003},3502.5224452500001,642.60767025000007,21]
[null,"    AN 6       2029",12,584.77297992750005,{"$f":"E16-D17","v":5912.7045748225},4087.2954251775,584.77297992750005,20]
[null,"    AN 7       2030",12,532.14341173402499,5380.561163088475,4619.438836911525,532.14341173402499,19]
[null,"    AN 8       2031",12,484.25050467796274,4896.3106584105126,5103.6893415894874,484.25050467796274,18]
[null,"    AN 9       2032",12,440.66795925694612,{"$f":"E19-D20","v":4455.6426991535664},{"$f":"F19+D20","v":5544.3573008464336},440.66795925694612,17]
[null,"    AN 10       2033",12,401.00784292382093,4054.6348562297453,5945.3651437702547,401.00784292382093,16]
[null,"    AN 11       2034",12,{"$f":"IF(G22<$G$11,E21/H22,G22)","v":270.30899041531637},3784.3258658144291,6215.6741341855713,364.91713706067708,15]
[null,"    AN 12       2035",12,270.30899041531637,3514.0168753991129,6485.983124600888,340.58932792329858,14]
[null,"    AN 13       2036",12,270.30899041531637,3243.7078849837967,6756.2921150162047,316.26151878592015,13]
[null,"    AN 14       2037",12,270.30899041531637,2973.3988945684805,7026.6011054315213,291.93370964854171,12]
[null,"    AN 15       2038",12,270.30899041531643,2703.0899041531638,7296.910095846838,267.60590051116321,11]
[null,"    AN 16       2039",12,270.30899041531637,2432.7809137378476,7567.2190862621546,243.27809137378475,10]
[null,"    AN 17       2040",12,270.30899041531643,2162.4719233225314,7837.5280766774713,218.95028223640628,9]
[null,"    AN 18       2041",12,270.30899041531643,1892.162932907215,8107.8370670927879,194.62247309902781,8]
[null,"    AN 19       2042",12,270.30899041531643,1621.8539424918986,8378.1460575081037,170.29466396164935,7]
[null,"    AN 20       2043",12,270.30899041531643,1351.5449520765821,8648.4550479234204,145.96685482427085,6]
[null,"    AN 21       2044",12,270.30899041531643,1081.2359616612657,8918.764038338737,121.63904568689239,5]
[null,"    AN 22       2045",12,270.30899041531643,810.92697124594929,9189.0730287540537,97.311236549513907,4]
[null,"    AN 23       2046",12,270.30899041531643,540.61798083063286,9459.3820191693703,72.983427412135427,3]
[null,"    AN 24       2047",12,270.30899041531643,270.30899041531643,9729.691009584687,48.655618274756954,2]
[null,"    AN 25       2048",12,270.30899041531643,0,10000.000000000004,24.327809137378477,1]